Reaction Details
TargetCytochrome P450 2C9
LigandBDBM50306005
Substrate/Competitorn/a
Meas. Tech.ChEMBL_605685 (CHEMBL1071215)
IC50 30000±n/a nM
Citation Gilbert, EJZhou, GWong, MKTong, LShankar, BBHuang, CKelly, JLavey, BJMcCombie, SWChen, LRizvi, RDong, YShu, YKozlowski, JAShih, NYHipkin, RWGonsiorek, WMalikzay, ALunn, CAFavreau, LLundell, DJ Non-aromatic A-ring replacement in the triaryl bis-sulfone CB2 receptor inhibitors. Bioorg Med Chem Lett20:608-11 (2010) 
 
Cytochrome P450 2C9
Name:Cytochrome P450 2C9
Type:Enzyme
Mol. Mass.:55636.33
Organism:Homo sapiens (Human)
Description:P11712
Residue:490
BDBM50306005
NameBDBM50306005
Synonyms:1,1,1-trifluoro-N-(6-(2-(2-fluorophenylsulfonyl)-5-(trifluoromethoxy)phenylsulfonyl)-6-azaspiro[2.5]octan-1-yl)methanesulfonamide | CHEMBL596356
TypeSmall organic molecule
Emp. Form.C21H19F7N2O7S3
Mol. Mass.640.569
SMILESFc1ccccc1S(=O)(=O)c1ccc(OC(F)(F)F)cc1S(=O)(=O)N1CCC2(CC2NS(=O)(=O)C(F)(F)F)CC1