Reaction Details
TargetCytochrome P450 2C9
LigandBDBM50306007
Substrate/Competitorn/a
Meas. Tech.ChEMBL_605685 (CHEMBL1071215)
IC50 15000±n/a nM
Citation Gilbert, EJZhou, GWong, MKTong, LShankar, BBHuang, CKelly, JLavey, BJMcCombie, SWChen, LRizvi, RDong, YShu, YKozlowski, JAShih, NYHipkin, RWGonsiorek, WMalikzay, ALunn, CAFavreau, LLundell, DJ Non-aromatic A-ring replacement in the triaryl bis-sulfone CB2 receptor inhibitors. Bioorg Med Chem Lett20:608-11 (2010) 
 
Cytochrome P450 2C9
Name:Cytochrome P450 2C9
Type:Enzyme
Mol. Mass.:55636.33
Organism:Homo sapiens (Human)
Description:P11712
Residue:490
BDBM50306007
NameBDBM50306007
Synonyms:CHEMBL592896 | N-(6-(5-chloro-2-(pyridin-2-ylsulfonyl)phenylsulfonyl)-6-azaspiro[2.5]octan-1-yl)-1,1,1-trifluoromethanesulfonamide
TypeSmall organic molecule
Emp. Form.C19H19ClF3N3O6S3
Mol. Mass.574.014
SMILESFC(F)(F)S(=O)(=O)NC1CC11CCN(CC1)S(=O)(=O)c1cc(Cl)ccc1S(=O)(=O)c1ccccn1