Reaction Details
TargetCytochrome P450 2C9
LigandBDBM50306008
Substrate/Competitorn/a
Meas. Tech.ChEMBL_605685 (CHEMBL1071215)
IC50 30000±n/a nM
Citation Gilbert, EJZhou, GWong, MKTong, LShankar, BBHuang, CKelly, JLavey, BJMcCombie, SWChen, LRizvi, RDong, YShu, YKozlowski, JAShih, NYHipkin, RWGonsiorek, WMalikzay, ALunn, CAFavreau, LLundell, DJ Non-aromatic A-ring replacement in the triaryl bis-sulfone CB2 receptor inhibitors. Bioorg Med Chem Lett20:608-11 (2010) 
 
Cytochrome P450 2C9
Name:Cytochrome P450 2C9
Type:Enzyme
Mol. Mass.:55636.33
Organism:Homo sapiens (Human)
Description:P11712
Residue:490
BDBM50306008
NameBDBM50306008
Synonyms:1,1,1-trifluoro-N-(6-(2-(pyridin-2-ylsulfonyl)-5-(trifluoromethoxy)phenylsulfonyl)-6-azaspiro[2.5]octan-1-yl)methanesulfonamide | CHEMBL595223
TypeSmall organic molecule
Emp. Form.C20H19F6N3O7S3
Mol. Mass.623.566
SMILESFC(F)(F)Oc1ccc(c(c1)S(=O)(=O)N1CCC2(CC2NS(=O)(=O)C(F)(F)F)CC1)S(=O)(=O)c1ccccn1