Reaction Details
TargetCannabinoid receptor 1
LigandBDBM50306010
Substrate/Competitorn/a
Meas. Tech.ChEMBL_605683 (CHEMBL1071213)
Ki 6900±n/a nM
Citation Gilbert, EJZhou, GWong, MKTong, LShankar, BBHuang, CKelly, JLavey, BJMcCombie, SWChen, LRizvi, RDong, YShu, YKozlowski, JAShih, NYHipkin, RWGonsiorek, WMalikzay, ALunn, CAFavreau, LLundell, DJ Non-aromatic A-ring replacement in the triaryl bis-sulfone CB2 receptor inhibitors. Bioorg Med Chem Lett20:608-11 (2010) 
 
Cannabinoid receptor 1
Name:Cannabinoid receptor 1
Type:G Protein-Coupled Receptor (GPCR)
Mol. Mass.:52868.96
Organism:Homo sapiens (Human)
Description:P21554
Residue:472
BDBM50306010
NameBDBM50306010
Synonyms:CHEMBL595452 | cis-4-chloro-2-(2-fluorophenylsulfonyl)-N-(4-(trifluoromethylsulfonamido)cyclohexyl)benzenesulfonamide
TypeSmall organic molecule
Emp. Form.C19H19ClF4N2O6S3
Mol. Mass.579.006
SMILESFc1ccccc1S(=O)(=O)c1cc(Cl)ccc1S(=O)(=O)N[C@H]1CC[C@H](CC1)NS(=O)(=O)C(F)(F)F