Reaction Details
TargetCannabinoid receptor 1
LigandBDBM50306012
Substrate/Competitorn/a
Meas. Tech.ChEMBL_605683 (CHEMBL1071213)
Ki>10000±n/a nM
Citation Gilbert, EJZhou, GWong, MKTong, LShankar, BBHuang, CKelly, JLavey, BJMcCombie, SWChen, LRizvi, RDong, YShu, YKozlowski, JAShih, NYHipkin, RWGonsiorek, WMalikzay, ALunn, CAFavreau, LLundell, DJ Non-aromatic A-ring replacement in the triaryl bis-sulfone CB2 receptor inhibitors. Bioorg Med Chem Lett20:608-11 (2010) 
 
Cannabinoid receptor 1
Name:Cannabinoid receptor 1
Type:G Protein-Coupled Receptor (GPCR)
Mol. Mass.:52868.96
Organism:Homo sapiens (Human)
Description:P21554
Residue:472
BDBM50306012
NameBDBM50306012
Synonyms:CHEMBL604683 | trans-4-chloro-2-(2-fluorophenylsulfonyl)-N-((1r,4r)-4-((trifluoromethylsulfonamido)methyl)cyclohexyl)benzenesulfonamide
TypeSmall organic molecule
Emp. Form.C20H21ClF4N2O6S3
Mol. Mass.593.032
SMILESFc1ccccc1S(=O)(=O)c1cc(Cl)ccc1S(=O)(=O)N[C@H]1CC[C@H](CNS(=O)(=O)C(F)(F)F)CC1