Reaction Details
TargetCannabinoid receptor 1
LigandBDBM50306019
Substrate/Competitorn/a
Meas. Tech.ChEMBL_605683 (CHEMBL1071213)
Ki 560±n/a nM
Citation Gilbert, EJZhou, GWong, MKTong, LShankar, BBHuang, CKelly, JLavey, BJMcCombie, SWChen, LRizvi, RDong, YShu, YKozlowski, JAShih, NYHipkin, RWGonsiorek, WMalikzay, ALunn, CAFavreau, LLundell, DJ Non-aromatic A-ring replacement in the triaryl bis-sulfone CB2 receptor inhibitors. Bioorg Med Chem Lett20:608-11 (2010) 
 
Cannabinoid receptor 1
Name:Cannabinoid receptor 1
Type:G Protein-Coupled Receptor (GPCR)
Mol. Mass.:52868.96
Organism:Homo sapiens (Human)
Description:P21554
Residue:472
BDBM50306019
NameBDBM50306019
Synonyms:(+/-)-N-(((2S)-1-(4-chloro-2-(2-fluorophenylsulfonyl)phenylsulfonyl)-2-methylpiperidin-4-yl)methyl)-1,1,1-trifluoromethanesulfonamide | CHEMBL593434
TypeSmall organic molecule
Emp. Form.C20H21ClF4N2O6S3
Mol. Mass.593.032
SMILESC[C@H]1CC(CNS(=O)(=O)C(F)(F)F)CCN1S(=O)(=O)c1ccc(Cl)cc1S(=O)(=O)c1ccccc1F