Reaction Details
TargetCannabinoid receptor 2
LigandBDBM50306002
Substrate/Competitorn/a
Meas. Tech.ChEMBL_605682 (CHEMBL1071212)
Ki 0.65±n/a nM
Citation Gilbert, EJZhou, GWong, MKTong, LShankar, BBHuang, CKelly, JLavey, BJMcCombie, SWChen, LRizvi, RDong, YShu, YKozlowski, JAShih, NYHipkin, RWGonsiorek, WMalikzay, ALunn, CAFavreau, LLundell, DJ Non-aromatic A-ring replacement in the triaryl bis-sulfone CB2 receptor inhibitors. Bioorg Med Chem Lett20:608-11 (2010) 
 
Cannabinoid receptor 2
Name:Cannabinoid receptor 2
Type:G Protein-Coupled Receptor (GPCR)
Mol. Mass.:39690.94
Organism:Homo sapiens (Human)
Description:P34972
Residue:360
BDBM50306002
NameBDBM50306002
Synonyms:CHEMBL595705 | N-(6-(5-chloro-2-(4-methoxyphenylsulfonyl)phenylsulfonyl)-6-azaspiro[2.5]octan-1-yl)-1,1,1-trifluoromethanesulfonamide
TypeSmall organic molecule
Emp. Form.C21H22ClF3N2O7S3
Mol. Mass.603.052
SMILESCOc1ccc(cc1)S(=O)(=O)c1ccc(Cl)cc1S(=O)(=O)N1CCC2(CC2NS(=O)(=O)C(F)(F)F)CC1