Reaction Details
TargetCannabinoid receptor 2
LigandBDBM50306005
Substrate/Competitorn/a
Meas. Tech.ChEMBL_605682 (CHEMBL1071212)
Ki 3±n/a nM
Citation Gilbert, EJZhou, GWong, MKTong, LShankar, BBHuang, CKelly, JLavey, BJMcCombie, SWChen, LRizvi, RDong, YShu, YKozlowski, JAShih, NYHipkin, RWGonsiorek, WMalikzay, ALunn, CAFavreau, LLundell, DJ Non-aromatic A-ring replacement in the triaryl bis-sulfone CB2 receptor inhibitors. Bioorg Med Chem Lett20:608-11 (2010) 
 
Cannabinoid receptor 2
Name:Cannabinoid receptor 2
Type:G Protein-Coupled Receptor (GPCR)
Mol. Mass.:39690.94
Organism:Homo sapiens (Human)
Description:P34972
Residue:360
BDBM50306005
NameBDBM50306005
Synonyms:1,1,1-trifluoro-N-(6-(2-(2-fluorophenylsulfonyl)-5-(trifluoromethoxy)phenylsulfonyl)-6-azaspiro[2.5]octan-1-yl)methanesulfonamide | CHEMBL596356
TypeSmall organic molecule
Emp. Form.C21H19F7N2O7S3
Mol. Mass.640.569
SMILESFc1ccccc1S(=O)(=O)c1ccc(OC(F)(F)F)cc1S(=O)(=O)N1CCC2(CC2NS(=O)(=O)C(F)(F)F)CC1