Reaction Details
TargetRho-associated protein kinase 1
LigandBDBM50306084
Substrate/Competitorn/a
Meas. Tech.ChEMBL_606055 (CHEMBL1071954)
IC50 7600±n/a nM
Citation Lin, HYamashita, DSZeng, JXie, RWang, WNidarmarthy, SLuengo, JIRhodes, NKnick, VBChoudhry, AELai, ZMinthorn, EAStrum, SLWood, ERElkins, PAConcha, NOHeerding, DA 2,3,5-Trisubstituted pyridines as selective AKT inhibitors-Part I: Substitution at 2-position of the core pyridine for ROCK1 selectivity. Bioorg Med Chem Lett20:673-8 (2010) 
 
Rho-associated protein kinase 1
Name:Rho-associated protein kinase 1
Type:Serine/threonine-protein kinase
Mol. Mass.:158156.77
Organism:Homo sapiens (Human)
Description:Q13464
Residue:1354
BDBM50306084
NameBDBM50306084
Synonyms:2-(5-((S)-2-amino-3-phenylpropoxy)-3-(3-methyl-1H-indazol-5-yl)pyridin-2-yl)-4-chlorophenol | CHEMBL605733
TypeSmall organic molecule
Emp. Form.C28H25ClN4O2
Mol. Mass.484.977
SMILESCc1n[nH]c2ccc(cc12)-c1cc(OC[C@@H](N)Cc2ccccc2)cnc1-c1cc(Cl)ccc1O