Reaction Details
TargetRAC-alpha serine/threonine-protein kinase
LigandBDBM50306092
Substrate/Competitorn/a
Meas. Tech.ChEMBL_606053 (CHEMBL1071952)
IC50 10±n/a nM
Citation Lin, HYamashita, DSZeng, JXie, RWang, WNidarmarthy, SLuengo, JIRhodes, NKnick, VBChoudhry, AELai, ZMinthorn, EAStrum, SLWood, ERElkins, PAConcha, NOHeerding, DA 2,3,5-Trisubstituted pyridines as selective AKT inhibitors-Part I: Substitution at 2-position of the core pyridine for ROCK1 selectivity. Bioorg Med Chem Lett20:673-8 (2010) 
 
RAC-alpha serine/threonine-protein kinase
Name:RAC-alpha serine/threonine-protein kinase
Type:Enzyme
Mol. Mass.:55681.25
Organism:Homo sapiens (Human)
Description:P31749
Residue:480
BDBM50306092
NameBDBM50306092
Synonyms:(S)-1-(6-(furan-3-yl)-5-(3-methyl-1H-indazol-5-yl)pyridin-3-yloxy)-3-(1H-pyrrolo[3,2-b]pyridin-3-yl)propan-2-amine | CHEMBL605838
TypeSmall organic molecule
Emp. Form.C27H24N6O2
Mol. Mass.464.5185
SMILESCc1n[nH]c2ccc(cc12)-c1cc(OC[C@@H](N)Cc2c[nH]c3cccnc23)cnc1-c1ccoc1