Reaction Details
TargetRAC-alpha serine/threonine-protein kinase
LigandBDBM50306095
Substrate/Competitorn/a
Meas. Tech.ChEMBL_606053 (CHEMBL1071952)
IC50 0.8±n/a nM
Citation Lin, HYamashita, DSZeng, JXie, RWang, WNidarmarthy, SLuengo, JIRhodes, NKnick, VBChoudhry, AELai, ZMinthorn, EAStrum, SLWood, ERElkins, PAConcha, NOHeerding, DA 2,3,5-Trisubstituted pyridines as selective AKT inhibitors-Part I: Substitution at 2-position of the core pyridine for ROCK1 selectivity. Bioorg Med Chem Lett20:673-8 (2010) 
 
RAC-alpha serine/threonine-protein kinase
Name:RAC-alpha serine/threonine-protein kinase
Type:Enzyme
Mol. Mass.:55681.25
Organism:Homo sapiens (Human)
Description:P31749
Residue:480
BDBM50306095
NameBDBM50306095
Synonyms:(S)-1-(6-fluoro-1H-indol-3-yl)-3-(6-(furan-3-yl)-5-(3-methyl-1H-indazol-5-yl)pyridin-3-yloxy)propan-2-amine | CHEMBL607374
TypeSmall organic molecule
Emp. Form.C28H24FN5O2
Mol. Mass.481.5209
SMILESCc1n[nH]c2ccc(cc12)-c1cc(OC[C@@H](N)Cc2c[nH]c3cc(F)ccc23)cnc1-c1ccoc1