Reaction Details
TargetAcyl-CoA desaturase 1
LigandBDBM50306124
Substrate/Competitorn/a
Meas. Tech.ChEMBL_606059 (CHEMBL1071958)
IC50 0.6±n/a nM
Citation Uto, YKiyotsuka, YUeno, YMiyazawa, YKurata, HOgata, TDeguchi, TYamada, MWatanabe, NKonishi, MKurikawa, NTakagi, TWakimoto, SKono, KOhsumi, J Novel spiropiperidine-based stearoyl-CoA desaturase-1 inhibitors: Identification of 1'-{6-[5-(pyridin-3-ylmethyl)-1,3,4-oxadiazol-2-yl]pyridazin-3-yl}-5-(trifluoromethyl)-3,4-dihydrospiro[chromene-2,4'-piperidine]. Bioorg Med Chem Lett20:746-54 (2010) 
 
Acyl-CoA desaturase 1
Name:Acyl-CoA desaturase 1
Type:PROTEIN
Mol. Mass.:41064.54
Organism:Mus musculus
Description:ChEMBL_1462109
Residue:355
BDBM50306124
NameBDBM50306124
Synonyms:6-(5-chlorospiro[chroman-2,4'-piperidine]-1'-yl)-N-(2-hydroxy-2-(pyridin-3-yl)ethyl)pyridazine-3-carboxamide | CHEMBL595254
TypeSmall organic molecule
Emp. Form.C25H26ClN5O3
Mol. Mass.479.959
SMILESOC(CNC(=O)c1ccc(nn1)N1CCC2(CC1)CCc1c(Cl)cccc1O2)c1cccnc1