Reaction Details
TargetCoagulation factor X
LigandBDBM50306139
Substrate/Competitorn/a
Meas. Tech.ChEMBL_606078 (CHEMBL1071977)
Ki 5±n/a nM
Citation Kleanthous, SBorthwick, ADBrown, DBurns-Kurtis, CLCampbell, MChaudry, LChan, CClarte, MOConvery, MAHarling, JDHortense, EIrving, WRIrvine, SPateman, AJPatikis, ANPinto, ILPollard, DRRoethka, TJSenger, SShah, GPStelman, GJToomey, JRWatson, NSWest, RIWhittaker, CZhou, PYoung, RJ Structure and property based design of factor Xa inhibitors: pyrrolidin-2-ones with monoaryl P4 motifs. Bioorg Med Chem Lett20:618-22 (2010) 
 
Coagulation factor X
Name:Coagulation factor X
Type:Enzyme
Mol. Mass.:54726.60
Organism:Homo sapiens (Human)
Description:n/a
Residue:488
BDBM50306139
NameBDBM50306139
Synonyms:6-chloro-N-((3S)-1-(2-fluoro-4-(1-(isopropyl(methyl)amino)ethyl)phenyl)-2-oxopyrrolidin-3-yl)naphthalene-2-sulfonamide | CHEMBL594538
TypeSmall organic molecule
Emp. Form.C26H29ClFN3O3S
Mol. Mass.518.043
SMILESCC(C)N(C)C(C)c1ccc(N2CC[C@H](NS(=O)(=O)c3ccc4cc(Cl)ccc4c3)C2=O)c(F)c1