Reaction Details
TargetCoagulation factor X
LigandBDBM50306144
Substrate/Competitorn/a
Meas. Tech.ChEMBL_606078 (CHEMBL1071977)
Ki 2±n/a nM
Citation Kleanthous, SBorthwick, ADBrown, DBurns-Kurtis, CLCampbell, MChaudry, LChan, CClarte, MOConvery, MAHarling, JDHortense, EIrving, WRIrvine, SPateman, AJPatikis, ANPinto, ILPollard, DRRoethka, TJSenger, SShah, GPStelman, GJToomey, JRWatson, NSWest, RIWhittaker, CZhou, PYoung, RJ Structure and property based design of factor Xa inhibitors: pyrrolidin-2-ones with monoaryl P4 motifs. Bioorg Med Chem Lett20:618-22 (2010) 
 
Coagulation factor X
Name:Coagulation factor X
Type:Enzyme
Mol. Mass.:54726.60
Organism:Homo sapiens (Human)
Description:n/a
Residue:488
BDBM50306144
NameBDBM50306144
Synonyms:6-chloro-N-((S)-1-(4-((R)-1-(dimethylamino)ethyl)-2-fluorophenyl)-2-oxopyrrolidin-3-yl)naphthalene-2-sulfonamide | CHEMBL594313
TypeSmall organic molecule
Emp. Form.C24H25ClFN3O3S
Mol. Mass.489.99
SMILESC[C@@H](N(C)C)c1ccc(N2CC[C@H](NS(=O)(=O)c3ccc4cc(Cl)ccc4c3)C2=O)c(F)c1