Reaction Details
TargetCoagulation factor X
LigandBDBM50306153
Substrate/Competitorn/a
Meas. Tech.ChEMBL_606078 (CHEMBL1071977)
Ki 0.2±n/a nM
Citation Kleanthous, SBorthwick, ADBrown, DBurns-Kurtis, CLCampbell, MChaudry, LChan, CClarte, MOConvery, MAHarling, JDHortense, EIrving, WRIrvine, SPateman, AJPatikis, ANPinto, ILPollard, DRRoethka, TJSenger, SShah, GPStelman, GJToomey, JRWatson, NSWest, RIWhittaker, CZhou, PYoung, RJ Structure and property based design of factor Xa inhibitors: pyrrolidin-2-ones with monoaryl P4 motifs. Bioorg Med Chem Lett20:618-22 (2010) 
 
Coagulation factor X
Name:Coagulation factor X
Type:Enzyme
Mol. Mass.:54726.60
Organism:Homo sapiens (Human)
Description:n/a
Residue:488
BDBM50306153
NameBDBM50306153
Synonyms:(S)-2-(5-chlorothiophen-2-yl)-N-(1-(3-fluoro-2'-(methylsulfonyl)biphenyl-4-yl)-2-oxopyrrolidin-3-yl)ethenesulfonamide | CHEMBL595475
TypeSmall organic molecule
Emp. Form.C23H20ClFN2O5S3
Mol. Mass.555.062
SMILESCS(=O)(=O)c1ccccc1-c1ccc(N2CC[C@H](NS(=O)(=O)\C=C\c3ccc(Cl)s3)C2=O)c(F)c1