Reaction Details
TargetRAC-alpha serine/threonine-protein kinase
LigandBDBM50306160
Substrate/Competitorn/a
Meas. Tech.ChEMBL_606082 (CHEMBL1072610)
IC50 3±n/a nM
Citation Lin, HYamashita, DSXie, RZeng, JWang, WLeber, JSafonov, IGVerma, SLi, MLafrance, LVenslavsky, JTakata, DLuengo, JIKahana, JAZhang, SRobell, KALevy, DKumar, RChoudhry, AESchaber, MLai, ZBrown, BSDonovan, BTMinthorn, EABrown, KKHeerding, DA Tetrasubstituted pyridines as potent and selective AKT inhibitors: Reduced CYP450 and hERG inhibition of aminopyridines. Bioorg Med Chem Lett20:684-8 (2010) 
 
RAC-alpha serine/threonine-protein kinase
Name:RAC-alpha serine/threonine-protein kinase
Type:Enzyme
Mol. Mass.:55681.25
Organism:Homo sapiens (Human)
Description:P31749
Residue:480
BDBM50306160
NameBDBM50306160
Synonyms:(S)-1-(6-(furan-3-yl)-2-methyl-5-(3-methyl-1H-pyrazolo[4,3-b]pyrazin-5-yl)pyridin-3-yloxy)-3-(1H-indol-3-yl)propan-2-amine | CHEMBL594523
TypeSmall organic molecule
Emp. Form.C27H25N7O2
Mol. Mass.479.5331
SMILESCc1n[nH]c2ncc(nc12)-c1cc(OC[C@@H](N)Cc2c[nH]c3ccccc23)c(C)nc1-c1ccoc1