Reaction Details
TargetPoly [ADP-ribose] polymerase 1
LigandBDBM50306181
Substrate/Competitorn/a
Meas. Tech.ChEMBL_606737 (CHEMBL1065327)
IC50 5±n/a nM
Citation Scarpelli, RBoueres, JKCerretani, MFerrigno, FOntoria, JMRowley, MSchultz-Fademrecht, CToniatti, CJones, P Synthesis and biological evaluation of substituted 2-phenyl-2H-indazole-7-carboxamides as potent poly(ADP-ribose) polymerase (PARP) inhibitors. Bioorg Med Chem Lett20:488-92 (2010) 
 
Poly [ADP-ribose] polymerase 1
Name:Poly [ADP-ribose] polymerase 1
Type:n/a
Mol. Mass.:113114.22
Organism:Homo sapiens (Human)
Description:P09874
Residue:1014
BDBM50306181
NameBDBM50306181
Synonyms:5-chloro-2-(4-((methylamino)methyl)phenyl)-2H-indazole-7-carboxamide | CHEMBL596581
TypeSmall organic molecule
Emp. Form.C16H15ClN4O
Mol. Mass.314.77
SMILESCNCc1ccc(cc1)-n1cc2cc(Cl)cc(C(N)=O)c2n1