Reaction Details
TargetPoly [ADP-ribose] polymerase 1
LigandBDBM50306190
Substrate/Competitorn/a
Meas. Tech.ChEMBL_606737 (CHEMBL1065327)
IC50 18±n/a nM
Citation Scarpelli, RBoueres, JKCerretani, MFerrigno, FOntoria, JMRowley, MSchultz-Fademrecht, CToniatti, CJones, P Synthesis and biological evaluation of substituted 2-phenyl-2H-indazole-7-carboxamides as potent poly(ADP-ribose) polymerase (PARP) inhibitors. Bioorg Med Chem Lett20:488-92 (2010) 
 
Poly [ADP-ribose] polymerase 1
Name:Poly [ADP-ribose] polymerase 1
Type:n/a
Mol. Mass.:113114.22
Organism:Homo sapiens (Human)
Description:P09874
Residue:1014
BDBM50306190
NameBDBM50306190
Synonyms:2-(4-((N-methylazetidine-3-carboxamido)methyl)phenyl)-2H-indazole-7-carboxamide | CHEMBL594312
TypeSmall organic molecule
Emp. Form.C20H21N5O2
Mol. Mass.363.413
SMILESCN(Cc1ccc(cc1)-n1cc2cccc(C(N)=O)c2n1)C(=O)C1CNC1