Reaction Details
TargetCannabinoid receptor 1
LigandBDBM50306216
Substrate/Competitorn/a
Meas. Tech.ChEMBL_606749 (CHEMBL1065339)
IC50 1.3±n/a nM
Citation Receveur, JMMurray, ALinget, JMNørregaard, PKCooper, MBjurling, ENielsen, PAHögberg, T Conversion of 4-cyanomethyl-pyrazole-3-carboxamides into CB1 antagonists with lowered propensity to pass the blood-brain-barrier. Bioorg Med Chem Lett20:453-7 (2010) 
 
Cannabinoid receptor 1
Name:Cannabinoid receptor 1
Type:G Protein-Coupled Receptor (GPCR)
Mol. Mass.:52868.96
Organism:Homo sapiens (Human)
Description:P21554
Residue:472
BDBM50306216
NameBDBM50306216
Synonyms:1-(2-chlorophenyl)-5-(4-chlorophenyl)-4-(2-(hydroxyamino)-2-iminoethyl)-N-(piperidin-1-yl)-1H-pyrazole-3-carboxamide | CHEMBL595017
TypeSmall organic molecule
Emp. Form.C23H24Cl2N6O2
Mol. Mass.487.382
SMILESONC(=N)Cc1c(nn(c1-c1ccc(Cl)cc1)-c1ccccc1Cl)C(=O)NN1CCCCC1