Reaction Details
TargetCannabinoid receptor 1
LigandBDBM50306226
Substrate/Competitorn/a
Meas. Tech.ChEMBL_606748 (CHEMBL1065338)
IC50 9.7±n/a nM
Citation Receveur, JMMurray, ALinget, JMNørregaard, PKCooper, MBjurling, ENielsen, PAHögberg, T Conversion of 4-cyanomethyl-pyrazole-3-carboxamides into CB1 antagonists with lowered propensity to pass the blood-brain-barrier. Bioorg Med Chem Lett20:453-7 (2010) 
 
Cannabinoid receptor 1
Name:Cannabinoid receptor 1
Type:G Protein-Coupled Receptor (GPCR)
Mol. Mass.:52868.96
Organism:Homo sapiens (Human)
Description:P21554
Residue:472
BDBM50306226
NameBDBM50306226
Synonyms:2-(1-(2-chlorophenyl)-5-(4-chlorophenyl)-3-(4-(pyrimidin-2-yl)piperidine-1-carbonyl)-1H-pyrazol-4-yl)acetimidamide | CHEMBL605721
TypeSmall organic molecule
Emp. Form.C27H25Cl2N7O
Mol. Mass.534.44
SMILESNC(=N)Cc1c(nn(c1-c1ccc(Cl)cc1)-c1ccccc1Cl)C(=O)N1CCC(CC1)c1ncccn1