Reaction Details
TargetCannabinoid receptor 1
LigandBDBM50305395
Substrate/Competitorn/a
Meas. Tech.ChEMBL_606748 (CHEMBL1065338)
IC50 2.1±n/a nM
Citation Receveur, JMMurray, ALinget, JMNørregaard, PKCooper, MBjurling, ENielsen, PAHögberg, T Conversion of 4-cyanomethyl-pyrazole-3-carboxamides into CB1 antagonists with lowered propensity to pass the blood-brain-barrier. Bioorg Med Chem Lett20:453-7 (2010) 
 
Cannabinoid receptor 1
Name:Cannabinoid receptor 1
Type:G Protein-Coupled Receptor (GPCR)
Mol. Mass.:52868.96
Organism:Homo sapiens (Human)
Description:P21554
Residue:472
BDBM50305395
NameBDBM50305395
Synonyms:1-(2-chlorophenyl)-5-(4-chlorophenyl)-4-(cyanomethyl)-N-(4-fluorobenzyl)-1H-pyrazole-3-carboxamide | CHEMBL594655
TypeSmall organic molecule
Emp. Form.C25H17Cl2FN4O
Mol. Mass.479.333
SMILESFc1ccc(CNC(=O)c2nn(c(c2CC#N)-c2ccc(Cl)cc2)-c2ccccc2Cl)cc1