Reaction Details
TargetCannabinoid receptor 1
LigandBDBM50306238
Substrate/Competitorn/a
Meas. Tech.ChEMBL_606748 (CHEMBL1065338)
IC50 30±n/a nM
Citation Receveur, JMMurray, ALinget, JMNørregaard, PKCooper, MBjurling, ENielsen, PAHögberg, T Conversion of 4-cyanomethyl-pyrazole-3-carboxamides into CB1 antagonists with lowered propensity to pass the blood-brain-barrier. Bioorg Med Chem Lett20:453-7 (2010) 
 
Cannabinoid receptor 1
Name:Cannabinoid receptor 1
Type:G Protein-Coupled Receptor (GPCR)
Mol. Mass.:52868.96
Organism:Homo sapiens (Human)
Description:P21554
Residue:472
BDBM50306238
NameBDBM50306238
Synonyms:1-(4-(2-amino-2-oxoethyl)-1-(2-chlorophenyl)-5-(4-chlorophenyl)-1H-pyrazole-3-carbonyl)-4-(5-fluoropyridin-2-yl)piperidine-4-carboxylic acid | CHEMBL594159
TypeSmall organic molecule
Emp. Form.C29H24Cl2FN5O4
Mol. Mass.596.436
SMILESNC(=O)Cc1c(nn(c1-c1ccc(Cl)cc1)-c1ccccc1Cl)C(=O)N1CCC(CC1)(C(O)=O)c1ccc(F)cn1