Reaction Details
TargetCannabinoid receptor 1
LigandBDBM50306217
Substrate/Competitorn/a
Meas. Tech.ChEMBL_607001 (CHEMBL1074629)
IC50 7.9±n/a nM
Citation Receveur, JMMurray, ALinget, JMNørregaard, PKCooper, MBjurling, ENielsen, PAHögberg, T Conversion of 4-cyanomethyl-pyrazole-3-carboxamides into CB1 antagonists with lowered propensity to pass the blood-brain-barrier. Bioorg Med Chem Lett20:453-7 (2010) 
 
Cannabinoid receptor 1
Name:Cannabinoid receptor 1
Type:G Protein-Coupled Receptor (GPCR)
Mol. Mass.:52868.96
Organism:Homo sapiens (Human)
Description:P21554
Residue:472
BDBM50306217
NameBDBM50306217
Synonyms:4-(2-amino-2-oxoethyl)-1-(2-chlorophenyl)-5-(4-chlorophenyl)-N-morpholino-1H-pyrazole-3-carboxamide | CHEMBL594756
TypeSmall organic molecule
Emp. Form.C22H21Cl2N5O3
Mol. Mass.474.34
SMILESNC(=O)Cc1c(nn(c1-c1ccc(Cl)cc1)-c1ccccc1Cl)C(=O)NN1CCOCC1