Reaction Details
TargetCannabinoid receptor 1
LigandBDBM50306235
Substrate/Competitorn/a
Meas. Tech.ChEMBL_607000 (CHEMBL1074628)
IC50 2.9±n/a nM
Citation Receveur, JMMurray, ALinget, JMNørregaard, PKCooper, MBjurling, ENielsen, PAHögberg, T Conversion of 4-cyanomethyl-pyrazole-3-carboxamides into CB1 antagonists with lowered propensity to pass the blood-brain-barrier. Bioorg Med Chem Lett20:453-7 (2010) 
 
Cannabinoid receptor 1
Name:Cannabinoid receptor 1
Type:G Protein-Coupled Receptor (GPCR)
Mol. Mass.:52868.96
Organism:Homo sapiens (Human)
Description:P21554
Residue:472
BDBM50306235
NameBDBM50306235
Synonyms:2-(1-(2-chlorophenyl)-5-(4-chlorophenyl)-3-(4-hydroxy-4-phenylpiperidine-1-carbonyl)-1H-pyrazol-4-yl)acetamide | CHEMBL605109
TypeSmall organic molecule
Emp. Form.C29H26Cl2N4O3
Mol. Mass.549.448
SMILESNC(=O)Cc1c(nn(c1-c1ccc(Cl)cc1)-c1ccccc1Cl)C(=O)N1CCC(O)(CC1)c1ccccc1