Reaction Details
TargetPoly [ADP-ribose] polymerase 1
LigandBDBM50306272
Substrate/Competitorn/a
Meas. Tech.ChEMBL_607019 (CHEMBL1074647)
IC50 8±n/a nM
Citation Torrisi, CBisbocci, MIngenito, ROntoria, JMRowley, MSchultz-Fademrecht, CToniatti, CJones, P Discovery and SAR of novel, potent and selective hexahydrobenzonaphthyridinone inhibitors of poly(ADP-ribose)polymerase-1 (PARP-1). Bioorg Med Chem Lett20:448-52 (2010) 
 
Poly [ADP-ribose] polymerase 1
Name:Poly [ADP-ribose] polymerase 1
Type:n/a
Mol. Mass.:113114.22
Organism:Homo sapiens (Human)
Description:P09874
Residue:1014
BDBM50306272
NameBDBM50306272
Synonyms:1-(2-phenylacetyl)-2,3,9,9a-tetrahydro-1H-benzo[de][1,7]naphthyridin-7(8H)-one | CHEMBL596389
TypeSmall organic molecule
Emp. Form.C19H18N2O2
Mol. Mass.306.3584
SMILESO=C(Cc1ccccc1)N1CCc2cccc3C(=O)NCC1c23