Reaction Details
TargetPoly [ADP-ribose] polymerase 1
LigandBDBM50306244
Substrate/Competitorn/a
Meas. Tech.ChEMBL_607019 (CHEMBL1074647)
IC50 16±n/a nM
Citation Torrisi, CBisbocci, MIngenito, ROntoria, JMRowley, MSchultz-Fademrecht, CToniatti, CJones, P Discovery and SAR of novel, potent and selective hexahydrobenzonaphthyridinone inhibitors of poly(ADP-ribose)polymerase-1 (PARP-1). Bioorg Med Chem Lett20:448-52 (2010) 
 
Poly [ADP-ribose] polymerase 1
Name:Poly [ADP-ribose] polymerase 1
Type:n/a
Mol. Mass.:113114.22
Organism:Homo sapiens (Human)
Description:P09874
Residue:1014
BDBM50306244
NameBDBM50306244
Synonyms:1-(2-(2-chlorophenyl)acetyl)-2,3,9,9a-tetrahydro-1H-benzo[de][1,7]naphthyridin-7(8H)-one | CHEMBL595927
TypeSmall organic molecule
Emp. Form.C19H17ClN2O2
Mol. Mass.340.803
SMILESClc1ccccc1CC(=O)N1CCc2cccc3C(=O)NCC1c23