Reaction Details
TargetPoly [ADP-ribose] polymerase 1
LigandBDBM50306242
Substrate/Competitorn/a
Meas. Tech.ChEMBL_607019 (CHEMBL1074647)
IC50 5±n/a nM
Citation Torrisi, CBisbocci, MIngenito, ROntoria, JMRowley, MSchultz-Fademrecht, CToniatti, CJones, P Discovery and SAR of novel, potent and selective hexahydrobenzonaphthyridinone inhibitors of poly(ADP-ribose)polymerase-1 (PARP-1). Bioorg Med Chem Lett20:448-52 (2010) 
 
Poly [ADP-ribose] polymerase 1
Name:Poly [ADP-ribose] polymerase 1
Type:n/a
Mol. Mass.:113114.22
Organism:Homo sapiens (Human)
Description:P09874
Residue:1014
BDBM50306242
NameBDBM50306242
Synonyms:1-(2-(4-chlorophenyl)acetyl)-2,3,9,9a-tetrahydro-1H-benzo[de][1,7]naphthyridin-7(8H)-one | CHEMBL594976
TypeSmall organic molecule
Emp. Form.C19H17ClN2O2
Mol. Mass.340.803
SMILESClc1ccc(CC(=O)N2CCc3cccc4C(=O)NCC2c34)cc1