Reaction Details
TargetPoly [ADP-ribose] polymerase 1
LigandBDBM50306278
Substrate/Competitorn/a
Meas. Tech.ChEMBL_607019 (CHEMBL1074647)
IC50 83±n/a nM
Citation Torrisi, CBisbocci, MIngenito, ROntoria, JMRowley, MSchultz-Fademrecht, CToniatti, CJones, P Discovery and SAR of novel, potent and selective hexahydrobenzonaphthyridinone inhibitors of poly(ADP-ribose)polymerase-1 (PARP-1). Bioorg Med Chem Lett20:448-52 (2010) 
 
Poly [ADP-ribose] polymerase 1
Name:Poly [ADP-ribose] polymerase 1
Type:n/a
Mol. Mass.:113114.22
Organism:Homo sapiens (Human)
Description:P09874
Residue:1014
BDBM50306278
NameBDBM50306278
Synonyms:1-(benzylsulfonyl)-2,3,9,9a-tetrahydro-1H-benzo[de][1,7]naphthyridin-7(8H)-one | CHEMBL594599
TypeSmall organic molecule
Emp. Form.C18H18N2O3S
Mol. Mass.342.412
SMILESO=C1NCC2N(CCc3cccc1c23)S(=O)(=O)Cc1ccccc1