Reaction Details
TargetPoly [ADP-ribose] polymerase 1
LigandBDBM50306277
Substrate/Competitorn/a
Meas. Tech.ChEMBL_607020 (CHEMBL1074648)
EC50 130±n/a nM
Citation Torrisi, CBisbocci, MIngenito, ROntoria, JMRowley, MSchultz-Fademrecht, CToniatti, CJones, P Discovery and SAR of novel, potent and selective hexahydrobenzonaphthyridinone inhibitors of poly(ADP-ribose)polymerase-1 (PARP-1). Bioorg Med Chem Lett20:448-52 (2010) 
 
Poly [ADP-ribose] polymerase 1
Name:Poly [ADP-ribose] polymerase 1
Type:n/a
Mol. Mass.:113114.22
Organism:Homo sapiens (Human)
Description:P09874
Residue:1014
BDBM50306277
NameBDBM50306277
Synonyms:CHEMBL595694 | benzyl 7-oxo-2,3,7,8,9,9a-hexahydro-1H-benzo[de][1,7]naphthyridine-1-carboxylate
TypeSmall organic molecule
Emp. Form.C19H18N2O3
Mol. Mass.322.3578
SMILESO=C(OCc1ccccc1)N1CCc2cccc3C(=O)NCC1c23