Reaction Details
TargetProtein mono-ADP-ribosyltransferase PARP4
LigandBDBM50306256
Substrate/Competitorn/a
Meas. Tech.ChEMBL_607028 (CHEMBL1074656)
IC50 660±n/a nM
Citation Torrisi, CBisbocci, MIngenito, ROntoria, JMRowley, MSchultz-Fademrecht, CToniatti, CJones, P Discovery and SAR of novel, potent and selective hexahydrobenzonaphthyridinone inhibitors of poly(ADP-ribose)polymerase-1 (PARP-1). Bioorg Med Chem Lett20:448-52 (2010) 
 
Protein mono-ADP-ribosyltransferase PARP4
Name:Protein mono-ADP-ribosyltransferase PARP4
Type:n/a
Mol. Mass.:192563.23
Organism:Homo sapiens (Human)
Description:Q9UKK3
Residue:1724
BDBM50306256
NameBDBM50306256
Synonyms:1-(3-(pyrazin-2-yl)propanoyl)-2,3,9,9a-tetrahydro-1H-benzo[de][1,7]naphthyridin-7(8H)-one | CHEMBL609002
TypeSmall organic molecule
Emp. Form.C18H18N4O2
Mol. Mass.322.3611
SMILESO=C(CCc1cnccn1)N1CCc2cccc3C(=O)NCC1c23