Reaction Details
TargetPoly [ADP-ribose] polymerase 1
LigandBDBM50306283
Substrate/Competitorn/a
Meas. Tech.ChEMBL_607019 (CHEMBL1074647)
IC50 50±n/a nM
Citation Torrisi, CBisbocci, MIngenito, ROntoria, JMRowley, MSchultz-Fademrecht, CToniatti, CJones, P Discovery and SAR of novel, potent and selective hexahydrobenzonaphthyridinone inhibitors of poly(ADP-ribose)polymerase-1 (PARP-1). Bioorg Med Chem Lett20:448-52 (2010) 
 
Poly [ADP-ribose] polymerase 1
Name:Poly [ADP-ribose] polymerase 1
Type:n/a
Mol. Mass.:113114.22
Organism:Homo sapiens (Human)
Description:P09874
Residue:1014
BDBM50306283
NameBDBM50306283
Synonyms:1-(3-(1,4-diazepane-1-carbonyl)benzoyl)-2,3,9,9a-tetrahydro-1H-benzo[de][1,7]naphthyridin-7(8H)-one | CHEMBL594975
TypeSmall organic molecule
Emp. Form.C24H26N4O3
Mol. Mass.418.4882
SMILESO=C(N1CCc2cccc3C(=O)NCC1c23)c1cccc(c1)C(=O)N1CCCNCC1