Reaction Details
TargetPoly [ADP-ribose] polymerase 1
LigandBDBM50306284
Substrate/Competitorn/a
Meas. Tech.ChEMBL_607019 (CHEMBL1074647)
IC50 410±n/a nM
Citation Torrisi, CBisbocci, MIngenito, ROntoria, JMRowley, MSchultz-Fademrecht, CToniatti, CJones, P Discovery and SAR of novel, potent and selective hexahydrobenzonaphthyridinone inhibitors of poly(ADP-ribose)polymerase-1 (PARP-1). Bioorg Med Chem Lett20:448-52 (2010) 
 
Poly [ADP-ribose] polymerase 1
Name:Poly [ADP-ribose] polymerase 1
Type:n/a
Mol. Mass.:113114.22
Organism:Homo sapiens (Human)
Description:P09874
Residue:1014
BDBM50306284
NameBDBM50306284
Synonyms:5-amino-3,4-dihydroisoquinolin-1(2H)-one | CHEMBL594759
TypeSmall organic molecule
Emp. Form.C9H10N2O
Mol. Mass.162.1885
SMILESNc1cccc2C(=O)NCCc12