Reaction Details
TargetPoly [ADP-ribose] polymerase 1
LigandBDBM50306286
Substrate/Competitorn/a
Meas. Tech.ChEMBL_607019 (CHEMBL1074647)
IC50 140±n/a nM
Citation Torrisi, CBisbocci, MIngenito, ROntoria, JMRowley, MSchultz-Fademrecht, CToniatti, CJones, P Discovery and SAR of novel, potent and selective hexahydrobenzonaphthyridinone inhibitors of poly(ADP-ribose)polymerase-1 (PARP-1). Bioorg Med Chem Lett20:448-52 (2010) 
 
Poly [ADP-ribose] polymerase 1
Name:Poly [ADP-ribose] polymerase 1
Type:n/a
Mol. Mass.:113114.22
Organism:Homo sapiens (Human)
Description:P09874
Residue:1014
BDBM50306286
NameBDBM50306286
Synonyms:1,2,3,8,9,9a-hexahydro-7H-benzo[de]-1,7-naphthyridin-7-one | CHEMBL608994
TypeSmall organic molecule
Emp. Form.C11H12N2O
Mol. Mass.188.2258
SMILESO=C1NCC2NCCc3cccc1c23