Reaction Details
TargetDelta-type opioid receptor
LigandBDBM50306289
Substrate/Competitorn/a
Meas. Tech.ChEMBL_607037 (CHEMBL1074665)
Ki 6.2±n/a nM
Citation Liras, SMcHardy, SFAllen, MPSegelstein, BEHeck, SDBryce, DKSchmidt, AWVanase-Frawley, MCallegari, EMcLean, S Biaryl piperidines as potent and selective delta opioid receptor ligands. Bioorg Med Chem Lett20:503-7 (2010) 
 
Delta-type opioid receptor
Name:Delta-type opioid receptor
Type:G Protein-Coupled Receptor (GPCR)
Mol. Mass.:40382.98
Organism:Homo sapiens (Human)
Description:Competition binding assays were carried out using membrane preparations from transfected HN9.10 cells that constitutively expressed the delta opioid receptor.
Residue:372
BDBM50306289
NameBDBM50306289
Synonyms:4-(1-butyl-3-(3-hydroxyphenyl)piperidin-3-yl)-N,N-diethylbenzamide | CHEMBL592907
TypeSmall organic molecule
Emp. Form.C26H36N2O2
Mol. Mass.408.5762
SMILESCCCCN1CCCC(C1)(c1ccc(cc1)C(=O)N(CC)CC)c1cccc(O)c1