Reaction Details
TargetDelta-type opioid receptor
LigandBDBM50306299
Substrate/Competitorn/a
Meas. Tech.ChEMBL_607037 (CHEMBL1074665)
Ki 1.8±n/a nM
Citation Liras, SMcHardy, SFAllen, MPSegelstein, BEHeck, SDBryce, DKSchmidt, AWVanase-Frawley, MCallegari, EMcLean, S Biaryl piperidines as potent and selective delta opioid receptor ligands. Bioorg Med Chem Lett20:503-7 (2010) 
 
Delta-type opioid receptor
Name:Delta-type opioid receptor
Type:G Protein-Coupled Receptor (GPCR)
Mol. Mass.:40382.98
Organism:Homo sapiens (Human)
Description:Competition binding assays were carried out using membrane preparations from transfected HN9.10 cells that constitutively expressed the delta opioid receptor.
Residue:372
BDBM50306299
NameBDBM50306299
Synonyms:CHEMBL595473 | N,N-diethyl-4-(4-(3-hydroxyphenyl)-1-(2-methylpentyl)piperidin-4-yl)benzamide
TypeSmall organic molecule
Emp. Form.C28H40N2O2
Mol. Mass.436.6294
SMILESCCCC(C)CN1CCC(CC1)(c1ccc(cc1)C(=O)N(CC)CC)c1cccc(O)c1