Reaction Details
TargetDelta-type opioid receptor
LigandBDBM50306296
Substrate/Competitorn/a
Meas. Tech.ChEMBL_607041 (CHEMBL1074669)
IC50 155±n/a nM
Citation Liras, SMcHardy, SFAllen, MPSegelstein, BEHeck, SDBryce, DKSchmidt, AWVanase-Frawley, MCallegari, EMcLean, S Biaryl piperidines as potent and selective delta opioid receptor ligands. Bioorg Med Chem Lett20:503-7 (2010) 
 
Delta-type opioid receptor
Name:Delta-type opioid receptor
Type:G Protein-Coupled Receptor (GPCR)
Mol. Mass.:40382.98
Organism:Homo sapiens (Human)
Description:Competition binding assays were carried out using membrane preparations from transfected HN9.10 cells that constitutively expressed the delta opioid receptor.
Residue:372
BDBM50306296
NameBDBM50306296
Synonyms:4-(1-(cyclopropylmethyl)-4-(3-hydroxyphenyl)piperidin-4-yl)-N,N-diethylbenzamide | CHEMBL595245
TypeSmall organic molecule
Emp. Form.C26H34N2O2
Mol. Mass.406.5604
SMILESCCN(CC)C(=O)c1ccc(cc1)C1(CCN(CC2CC2)CC1)c1cccc(O)c1