Reaction Details
TargetD(1B) dopamine receptor
LigandBDBM50306313
Substrate/Competitorn/a
Meas. Tech.ChEMBL_609555 (CHEMBL1073808)
Ki 3.9±n/a nM
Citation Qiang, LSasikumar, TKBurnett, DASu, JTang, HYe, YMazzola, RDZhu, ZMcKittrick, BAGreenlee, WJFawzi, ASmith, MZhang, HLachowicz, JE Discovery of new SCH 39166 analogs as potent and selective dopamine D1 receptor antagonists. Bioorg Med Chem Lett20:836-40 (2010) 
 
D(1B) dopamine receptor
Name:D(1B) dopamine receptor
Type:Protein
Mol. Mass.:52943.41
Organism:Homo sapiens (Human)
Description:P21918
Residue:477
BDBM50306313
NameBDBM50306313
Synonyms:(R)-8-chloro-5-(4-((cyclobutylamino)methyl)phenyl)-3-methyl-2,3,4,5-tetrahydro-1H-benzo[d]azepin-7-ol | CHEMBL596622
TypeSmall organic molecule
Emp. Form.C22H27ClN2O
Mol. Mass.370.916
SMILESCN1CCc2cc(Cl)c(O)cc2[C@H](C1)c1ccc(CNC2CCC2)cc1