Reaction Details
TargetD(1A) dopamine receptor
LigandBDBM50306437
Substrate/Competitorn/a
Meas. Tech.ChEMBL_609907 (CHEMBL1074769)
Ki 1.6±n/a nM
Citation Sasikumar, TKBurnett, DAGreenlee, WJSmith, MFawzi, AZhang, HLachowicz, JE Remote functionalization of SCH 39166: discovery of potent and selective benzazepine dopamine D1 receptor antagonists. Bioorg Med Chem Lett20:832-5 (2010) 
 
D(1A) dopamine receptor
Name:D(1A) dopamine receptor
Type:Enzyme
Mol. Mass.:49303.43
Organism:Homo sapiens (Human)
Description:P21728
Residue:446
BDBM50306437
NameBDBM50306437
Synonyms:11-chloro-12-hydroxy-7-methyl-6,6a,7,8,9,13b-hexahydro-5H-benzo[d]naphtho[2,1-b]azepine-4-carbaldehyde oxime | CHEMBL604732
TypeSmall organic molecule
Emp. Form.C20H21ClN2O2
Mol. Mass.356.846
SMILESCN1CCc2cc(Cl)c(O)cc2[C@@H]2[C@@H]1CCc1c(CN=O)cccc21