Reaction Details
TargetSodium-dependent serotonin transporter
LigandBDBM50306462
Substrate/Competitorn/a
Meas. Tech.ChEMBL_609921 (CHEMBL1074783)
Ki 9.25±n/a nM
Citation Venkatesan, AMDos Santos, OEllingboe, JEvrard, DAHarrison, BLSmith, DLScerni, RHornby, GASchechter, LEAndree, TH Novel benzofuran derivatives with dual 5-HT1A receptor and serotonin transporter affinity. Bioorg Med Chem Lett20:824-7 (2010) 
 
Sodium-dependent serotonin transporter
Name:Sodium-dependent serotonin transporter
Type:Multi-pass membrane protein
Mol. Mass.:70168.43
Organism:Rattus norvegicus (rat)
Description:P31652
Residue:630
BDBM50306462
NameBDBM50306462
Synonyms:5-fluoro-3-(1-(2-(5-fluorobenzofuran-3-yl)ethyl)-1,2,3,6-tetrahydropyridin-4-yl)-1H-indole | CHEMBL598866
TypeSmall organic molecule
Emp. Form.C23H20F2N2O
Mol. Mass.378.4145
SMILESFc1ccc2[nH]cc(C3=CCN(CCc4coc5ccc(F)cc45)CC3)c2c1