Reaction Details
TargetSodium-dependent serotonin transporter
LigandBDBM50306464
Substrate/Competitorn/a
Meas. Tech.ChEMBL_609921 (CHEMBL1074783)
Ki 54±n/a nM
Citation Venkatesan, AMDos Santos, OEllingboe, JEvrard, DAHarrison, BLSmith, DLScerni, RHornby, GASchechter, LEAndree, TH Novel benzofuran derivatives with dual 5-HT1A receptor and serotonin transporter affinity. Bioorg Med Chem Lett20:824-7 (2010) 
 
Sodium-dependent serotonin transporter
Name:Sodium-dependent serotonin transporter
Type:Multi-pass membrane protein
Mol. Mass.:70168.43
Organism:Rattus norvegicus (rat)
Description:P31652
Residue:630
BDBM50306464
NameBDBM50306464
Synonyms:5-fluoro-3-(1-(2-(5-methoxybenzofuran-3-yl)ethyl)-1,2,3,6-tetrahydropyridin-4-yl)-1H-indole | CHEMBL599066
TypeSmall organic molecule
Emp. Form.C24H23FN2O2
Mol. Mass.390.45
SMILESCOc1ccc2occ(CCN3CCC(=CC3)c3c[nH]c4ccc(F)cc34)c2c1