Reaction Details
TargetSodium-dependent serotonin transporter
LigandBDBM50306477
Substrate/Competitorn/a
Meas. Tech.ChEMBL_609921 (CHEMBL1074783)
Ki 1.97±n/a nM
Citation Venkatesan, AMDos Santos, OEllingboe, JEvrard, DAHarrison, BLSmith, DLScerni, RHornby, GASchechter, LEAndree, TH Novel benzofuran derivatives with dual 5-HT1A receptor and serotonin transporter affinity. Bioorg Med Chem Lett20:824-7 (2010) 
 
Sodium-dependent serotonin transporter
Name:Sodium-dependent serotonin transporter
Type:Multi-pass membrane protein
Mol. Mass.:70168.43
Organism:Rattus norvegicus (rat)
Description:P31652
Residue:630
BDBM50306477
NameBDBM50306477
Synonyms:6-fluoro-3-(1-(2-(7-methoxybenzofuran-3-yl)propyl)-1,2,3,6-tetrahydropyridin-4-yl)-1H-indole | CHEMBL597479
TypeSmall organic molecule
Emp. Form.C25H25FN2O2
Mol. Mass.404.4766
SMILESCOc1cccc2c(coc12)C(C)CN1CCC(=CC1)c1c[nH]c2cc(F)ccc12