Reaction Details
Target5-hydroxytryptamine receptor 1A
LigandBDBM50306480
Substrate/Competitorn/a
Meas. Tech.ChEMBL_609919 (CHEMBL1074781)
Ki 36.1±n/a nM
Citation Venkatesan, AMDos Santos, OEllingboe, JEvrard, DAHarrison, BLSmith, DLScerni, RHornby, GASchechter, LEAndree, TH Novel benzofuran derivatives with dual 5-HT1A receptor and serotonin transporter affinity. Bioorg Med Chem Lett20:824-7 (2010) 
 
5-hydroxytryptamine receptor 1A
Name:5-hydroxytryptamine receptor 1A
Type:n/a
Mol. Mass.:46122.49
Organism:Homo sapiens (Human)
Description:n/a
Residue:422
BDBM50306480
NameBDBM50306480
Synonyms:3-(1-(2-(benzofuran-3-yl)ethyl)-1,2,3,6-tetrahydropyridin-4-yl)-1H-indole | CHEMBL602244
TypeSmall organic molecule
Emp. Form.C23H22N2O
Mol. Mass.342.4336
SMILESC(Cc1coc2ccccc12)N1CCC(=CC1)c1c[nH]c2ccccc12