Reaction Details
Target5-hydroxytryptamine receptor 1A
LigandBDBM50306475
Substrate/Competitorn/a
Meas. Tech.ChEMBL_609919 (CHEMBL1074781)
Ki 29.2±n/a nM
Citation Venkatesan, AMDos Santos, OEllingboe, JEvrard, DAHarrison, BLSmith, DLScerni, RHornby, GASchechter, LEAndree, TH Novel benzofuran derivatives with dual 5-HT1A receptor and serotonin transporter affinity. Bioorg Med Chem Lett20:824-7 (2010) 
 
5-hydroxytryptamine receptor 1A
Name:5-hydroxytryptamine receptor 1A
Type:n/a
Mol. Mass.:46122.49
Organism:Homo sapiens (Human)
Description:n/a
Residue:422
BDBM50306475
NameBDBM50306475
Synonyms:3-(1-(2-(7-methoxybenzofuran-3-yl)propyl)-1,2,3,6-tetrahydropyridin-4-yl)-1H-indole | CHEMBL606384
TypeSmall organic molecule
Emp. Form.C25H26N2O2
Mol. Mass.386.4861
SMILESCOc1cccc2c(coc12)C(C)CN1CCC(=CC1)c1c[nH]c2ccccc12