Reaction Details
TargetSodium-dependent serotonin transporter
LigandBDBM50306479
Substrate/Competitorn/a
Meas. Tech.ChEMBL_609921 (CHEMBL1074783)
Ki 2.55±n/a nM
Citation Venkatesan, AMDos Santos, OEllingboe, JEvrard, DAHarrison, BLSmith, DLScerni, RHornby, GASchechter, LEAndree, TH Novel benzofuran derivatives with dual 5-HT1A receptor and serotonin transporter affinity. Bioorg Med Chem Lett20:824-7 (2010) 
 
Sodium-dependent serotonin transporter
Name:Sodium-dependent serotonin transporter
Type:Multi-pass membrane protein
Mol. Mass.:70168.43
Organism:Rattus norvegicus (rat)
Description:P31652
Residue:630
BDBM50306479
NameBDBM50306479
Synonyms:3-(1-(2-(benzofuran-3-yl)ethyl)-1,2,3,6-tetrahydropyridin-4-yl)-6-fluoro-1H-indole | CHEMBL599985
TypeSmall organic molecule
Emp. Form.C23H21FN2O
Mol. Mass.360.424
SMILESFc1ccc2c(c[nH]c2c1)C1=CCN(CCc2coc3ccccc23)CC1