Reaction Details
TargetSodium-dependent serotonin transporter
LigandBDBM50306483
Substrate/Competitorn/a
Meas. Tech.ChEMBL_609921 (CHEMBL1074783)
Ki 12±n/a nM
Citation Venkatesan, AMDos Santos, OEllingboe, JEvrard, DAHarrison, BLSmith, DLScerni, RHornby, GASchechter, LEAndree, TH Novel benzofuran derivatives with dual 5-HT1A receptor and serotonin transporter affinity. Bioorg Med Chem Lett20:824-7 (2010) 
 
Sodium-dependent serotonin transporter
Name:Sodium-dependent serotonin transporter
Type:Multi-pass membrane protein
Mol. Mass.:70168.43
Organism:Rattus norvegicus (rat)
Description:P31652
Residue:630
BDBM50306483
NameBDBM50306483
Synonyms:3-(1-(2-(6-chlorobenzofuran-3-yl)ethyl)-1,2,3,6-tetrahydropyridin-4-yl)-1H-indole | CHEMBL602865
TypeSmall organic molecule
Emp. Form.C23H21ClN2O
Mol. Mass.376.879
SMILESClc1ccc2c(CCN3CCC(=CC3)c3c[nH]c4ccccc34)coc2c1