Reaction Details
TargetPeroxisome proliferator-activated receptor delta
LigandBDBM50306513
Substrate/Competitorn/a
Meas. Tech.ChEMBL_610591 (CHEMBL1069605)
IC50>10000±n/a nM
Citation Lamotte, YMartres, PFaucher, NLaroze, AGrillot, DAncellin, NSaintillan, YBeneton, VGampe, RT Synthesis and biological activities of novel indole derivatives as potent and selective PPARgamma modulators. Bioorg Med Chem Lett20:1399-404 (2010) 
 
Peroxisome proliferator-activated receptor delta
Name:Peroxisome proliferator-activated receptor delta
Type:Enzyme
Mol. Mass.:49910.45
Organism:Homo sapiens (Human)
Description:Q03181
Residue:441
BDBM50306513
NameBDBM50306513
Synonyms:4'-((2-methyl-3-(methylthio)-5-(1-phenylpropylcarbamoyl)-1H-indol-1-yl)methyl)biphenyl-2-carboxylic acid | CHEMBL606422
TypeSmall organic molecule
Emp. Form.C34H32N2O3S
Mol. Mass.548.694
SMILESCCC(NC(=O)c1ccc2n(Cc3ccc(cc3)-c3ccccc3C(O)=O)c(C)c(SC)c2c1)c1ccccc1