Reaction Details
TargetPeroxisome proliferator-activated receptor alpha
LigandBDBM50306515
Substrate/Competitorn/a
Meas. Tech.ChEMBL_610590 (CHEMBL1068982)
IC50>10000±n/a nM
Citation Lamotte, YMartres, PFaucher, NLaroze, AGrillot, DAncellin, NSaintillan, YBeneton, VGampe, RT Synthesis and biological activities of novel indole derivatives as potent and selective PPARgamma modulators. Bioorg Med Chem Lett20:1399-404 (2010) 
 
Peroxisome proliferator-activated receptor alpha
Name:Peroxisome proliferator-activated receptor alpha
Type:Enzyme
Mol. Mass.:52222.08
Organism:Homo sapiens (Human)
Description:Q07869
Residue:468
BDBM50306515
NameBDBM50306515
Synonyms:4'-((5-(benzylcarbamoyl)-2,3-dimethyl-1H-indol-1-yl)methyl)biphenyl-2-carboxylic acid | CHEMBL602469
TypeSmall organic molecule
Emp. Form.C32H28N2O3
Mol. Mass.488.5763
SMILESCc1c(C)c2cc(ccc2n1Cc1ccc(cc1)-c1ccccc1C(O)=O)C(=O)NCc1ccccc1