Reaction Details
TargetPeroxisome proliferator-activated receptor gamma
LigandBDBM50306517
Substrate/Competitorn/a
Meas. Tech.ChEMBL_610589 (CHEMBL1068981)
IC50 321±n/a nM
Citation Lamotte, YMartres, PFaucher, NLaroze, AGrillot, DAncellin, NSaintillan, YBeneton, VGampe, RT Synthesis and biological activities of novel indole derivatives as potent and selective PPARgamma modulators. Bioorg Med Chem Lett20:1399-404 (2010) 
 
Peroxisome proliferator-activated receptor gamma
Name:Peroxisome proliferator-activated receptor gamma
Type:Nuclear Receptor
Mol. Mass.:57613.46
Organism:Homo sapiens (Human)
Description:P37231
Residue:505
BDBM50306517
NameBDBM50306517
Synonyms:4'-((2-methyl-6-(1-phenylpropylcarbamoyl)-1H-indol-1-yl)methyl)biphenyl-2-carboxylic acid | CHEMBL606425
TypeSmall organic molecule
Emp. Form.C33H30N2O3
Mol. Mass.502.6029
SMILESCCC(NC(=O)c1ccc2cc(C)n(Cc3ccc(cc3)-c3ccccc3C(O)=O)c2c1)c1ccccc1