Reaction Details
TargetCannabinoid receptor 2
LigandBDBM50306521
Substrate/Competitorn/a
Meas. Tech.ChEMBL_610882 (CHEMBL1065037)
Ki>3000±n/a nM
Citation Burdick, DDeOrazio, RGuzzo, PHabershaw, AHelle, MPaul, BWolf, M Synthesis and structure-activity relationship of substitutions at the C-1 position of Delta9-tetrahydrocannabinol. Bioorg Med Chem Lett20:1424-6 (2010) 
 
Cannabinoid receptor 2
Name:Cannabinoid receptor 2
Type:G Protein-Coupled Receptor (GPCR)
Mol. Mass.:39690.94
Organism:Homo sapiens (Human)
Description:P34972
Residue:360
BDBM50306521
NameBDBM50306521
Synonyms:(6aR,10aR)-N,N,6,6,9-pentamethyl-3-pentyl-6a,7,8,10a-tetrahydro-6H-benzo[c]chromen-1-amine | CHEMBL600426
TypeSmall organic molecule
Emp. Form.C23H35NO
Mol. Mass.341.5301
SMILESCCCCCc1cc2OC(C)(C)[C@@H]3CCC(C)=C[C@H]3c2c(c1)N(C)C