Reaction Details
TargetCannabinoid receptor 2
LigandBDBM50306528
Substrate/Competitorn/a
Meas. Tech.ChEMBL_610882 (CHEMBL1065037)
Ki 0.2±n/a nM
Citation Burdick, DDeOrazio, RGuzzo, PHabershaw, AHelle, MPaul, BWolf, M Synthesis and structure-activity relationship of substitutions at the C-1 position of Delta9-tetrahydrocannabinol. Bioorg Med Chem Lett20:1424-6 (2010) 
 
Cannabinoid receptor 2
Name:Cannabinoid receptor 2
Type:G Protein-Coupled Receptor (GPCR)
Mol. Mass.:39690.94
Organism:Homo sapiens (Human)
Description:P34972
Residue:360
BDBM50306528
NameBDBM50306528
Synonyms:(6aR,10aR)-6,6,9-trimethyl-3-(2-methyloctan-2-yl)-6a,7,8,10a-tetrahydro-6H-benzo[c]chromen-1-ol | CHEMBL600602
TypeSmall organic molecule
Emp. Form.C25H38O2
Mol. Mass.370.568
SMILESCCCCCCC(C)(C)c1cc(O)c2[C@@H]3C=C(C)CC[C@H]3C(C)(C)Oc2c1